Information card for entry 7035114
Formula | C90 H112 Cl4 F12 N4 O23 Rh6 S8 |
Calculated formula | C84 H94 Cl4 F6 N4 O16 Rh6 S6 |
Title of publication | A stepwise assembly of a molecular box from 16-electron half-sandwich precursors [Cp*M(pdt)] (M = Rh, Ir). |
Authors of publication | Liu, Jing-Jing; Lin, Yue-Jian; Jin, Guo-Xin |
Journal of publication | Dalton transactions (Cambridge, England : 2003) |
Year of publication | 2015 |
Journal volume | 44 |
Journal issue | 22 |
Pages of publication | 10281 - 10288 |
a | 13.871 ± 0.0009 Å |
b | 26.3536 ± 0.0017 Å |
c | 15.6676 ± 0.0011 Å |
α | 90° |
β | 98.026 ± 0.001° |
γ | 90° |
Cell volume | 5671.2 ± 0.7 Å3 |
Cell temperature | 173 ± 2 K |
Ambient diffraction temperature | 173 ± 2 K |
Number of distinct elements | 8 |
Space group number | 14 |
Hermann-Mauguin space group symbol | P 1 21/c 1 |
Hall space group symbol | -P 2ybc |
Residual factor for all reflections | 0.0843 |
Residual factor for significantly intense reflections | 0.0604 |
Weighted residual factors for significantly intense reflections | 0.1793 |
Weighted residual factors for all reflections included in the refinement | 0.1959 |
Goodness-of-fit parameter for all reflections included in the refinement | 1.031 |
Diffraction radiation wavelength | 0.71073 Å |
Diffraction radiation type | MoKα |