Information card for entry 7035116
Formula | C101 H140 Cl4 F12 N6 O28 Rh6 S8 |
Calculated formula | C101 H118 Cl4 F12 N6 O28 Rh6 S8 |
Title of publication | A stepwise assembly of a molecular box from 16-electron half-sandwich precursors [Cp*M(pdt)] (M = Rh, Ir). |
Authors of publication | Liu, Jing-Jing; Lin, Yue-Jian; Jin, Guo-Xin |
Journal of publication | Dalton transactions (Cambridge, England : 2003) |
Year of publication | 2015 |
Journal volume | 44 |
Journal issue | 22 |
Pages of publication | 10281 - 10288 |
a | 29.239 ± 0.004 Å |
b | 15.984 ± 0.002 Å |
c | 29.109 ± 0.004 Å |
α | 90° |
β | 110.88 ± 0.002° |
γ | 90° |
Cell volume | 12711 ± 3 Å3 |
Cell temperature | 173 ± 2 K |
Ambient diffraction temperature | 173 ± 2 K |
Number of distinct elements | 8 |
Space group number | 15 |
Hermann-Mauguin space group symbol | C 1 2/c 1 |
Hall space group symbol | -C 2yc |
Residual factor for all reflections | 0.128 |
Residual factor for significantly intense reflections | 0.0911 |
Weighted residual factors for significantly intense reflections | 0.2416 |
Weighted residual factors for all reflections included in the refinement | 0.2833 |
Goodness-of-fit parameter for all reflections included in the refinement | 1.048 |
Diffraction radiation wavelength | 0.71073 Å |
Diffraction radiation type | MoKα |