Information card for entry 7035118
Formula | C29 H27 K N8 Ni O9 |
Calculated formula | C29 H27 K N8 Ni O9 |
Title of publication | Potassium induced stitching of a flexible tripodal ligand into a bi-metallic two-dimensional coordination polymer for photo-degradation of organic dyes. |
Authors of publication | Bhardwaj, Vimal K. |
Journal of publication | Dalton transactions (Cambridge, England : 2003) |
Year of publication | 2015 |
Journal volume | 44 |
Journal issue | 19 |
Pages of publication | 8801 - 8804 |
a | 10.6994 ± 0.0004 Å |
b | 12.5806 ± 0.0005 Å |
c | 14.3433 ± 0.0005 Å |
α | 105.109 ± 0.001° |
β | 93.39 ± 0.001° |
γ | 93.644 ± 0.001° |
Cell volume | 1854.42 ± 0.12 Å3 |
Cell temperature | 296 ± 2 K |
Ambient diffraction temperature | 296.15 K |
Number of distinct elements | 6 |
Space group number | 2 |
Hermann-Mauguin space group symbol | P -1 |
Hall space group symbol | -P 1 |
Residual factor for all reflections | 0.0409 |
Residual factor for significantly intense reflections | 0.0359 |
Weighted residual factors for significantly intense reflections | 0.1159 |
Weighted residual factors for all reflections included in the refinement | 0.1193 |
Goodness-of-fit parameter for all reflections included in the refinement | 1.119 |
Diffraction radiation wavelength | 0.71073 Å |
Diffraction radiation type | MoKα |