Information card for entry 7035121
Formula | C138 H204 Hf3 N6 O12 |
Calculated formula | C138 H204 Hf3 N6 O12 |
Title of publication | Synthesis and characterization of group 4 metal alkoxide complexes containing imine based bis-bidentate ligands: effective catalysts for the ring opening polymerization of lactides, epoxides and polymerization of ethylene. |
Authors of publication | Roymuhury, Sagnik K.; Chakraborty, Debashis; Ramkumar, Venkatachalam |
Journal of publication | Dalton transactions (Cambridge, England : 2003) |
Year of publication | 2015 |
Journal volume | 44 |
Journal issue | 22 |
Pages of publication | 10352 - 10367 |
a | 19.1043 ± 0.0007 Å |
b | 29.5065 ± 0.0011 Å |
c | 30.3372 ± 0.001 Å |
α | 90° |
β | 97.805 ± 0.002° |
γ | 90° |
Cell volume | 16942.7 ± 1.1 Å3 |
Cell temperature | 296 ± 2 K |
Ambient diffraction temperature | 296 ± 2 K |
Number of distinct elements | 5 |
Space group number | 14 |
Hermann-Mauguin space group symbol | P 1 21/n 1 |
Hall space group symbol | -P 2yn |
Residual factor for all reflections | 0.1113 |
Residual factor for significantly intense reflections | 0.0489 |
Weighted residual factors for significantly intense reflections | 0.1087 |
Weighted residual factors for all reflections included in the refinement | 0.1219 |
Goodness-of-fit parameter for all reflections included in the refinement | 0.882 |
Diffraction radiation wavelength | 0.71073 Å |
Diffraction radiation type | MoKα |