Information card for entry 7035124
Formula | C18 H32 Cl2 Li2 N2 O3 |
Calculated formula | C18 H32 Cl2 Li2 N2 O3 |
Title of publication | Imido-pyridine Ti(iv) compounds: synthesis of unusual imido-amido heterobimetallic derivatives. |
Authors of publication | Pedrosa, Sergio; Vidal, Fernando; Lee, Lucia Myongwon; Vargas-Baca, Ignacio; Gómez-Sal, Pilar; Mosquera, Marta E. G. |
Journal of publication | Dalton transactions (Cambridge, England : 2003) |
Year of publication | 2015 |
Journal volume | 44 |
Journal issue | 24 |
Pages of publication | 11119 - 11128 |
a | 8.7259 ± 0.0008 Å |
b | 18.065 ± 0.002 Å |
c | 15.231 ± 0.002 Å |
α | 90° |
β | 101.634 ± 0.009° |
γ | 90° |
Cell volume | 2351.6 ± 0.5 Å3 |
Cell temperature | 200 ± 2 K |
Ambient diffraction temperature | 200 ± 2 K |
Number of distinct elements | 6 |
Space group number | 14 |
Hermann-Mauguin space group symbol | P 1 21/n 1 |
Hall space group symbol | -P 2yn |
Residual factor for all reflections | 0.1013 |
Residual factor for significantly intense reflections | 0.075 |
Weighted residual factors for significantly intense reflections | 0.1965 |
Weighted residual factors for all reflections included in the refinement | 0.2235 |
Goodness-of-fit parameter for all reflections included in the refinement | 1.095 |
Diffraction radiation probe | x-ray |
Diffraction radiation wavelength | 0.71073 Å |
Diffraction radiation type | MoKα |