Information card for entry 7035138
Common name | Cobalt sodium phosphate |
Chemical name | Cobalt sodium phosphate hydroxide |
Formula | Co12 H10.18 Na1.82 O38 P8 |
Calculated formula | Co12 H10.14 Na1.82 O38 P8 |
Title of publication | A novel cobalt sodium phosphate hydroxide with the ellenbergerite topology: crystal structure and physical properties. |
Authors of publication | Yakubovich, Olga V.; Kiriukhina, Galina V.; Dimitrova, Olga V.; Shvanskaya, Larisa V.; Volkova, Olga S.; Vasiliev, Alexander N. |
Journal of publication | Dalton transactions (Cambridge, England : 2003) |
Year of publication | 2015 |
Journal volume | 44 |
Journal issue | 26 |
Pages of publication | 11827 - 11834 |
a | 12.63 ± 0.003 Å |
b | 12.63 ± 0.003 Å |
c | 5.017 ± 0.001 Å |
α | 90° |
β | 90° |
γ | 120° |
Cell volume | 693.1 ± 0.3 Å3 |
Cell temperature | 293 ± 2 K |
Ambient diffraction temperature | 293 ± 2 K |
Number of distinct elements | 5 |
Space group number | 186 |
Hermann-Mauguin space group symbol | P 63 m c |
Hall space group symbol | P 6c -2c |
Residual factor for all reflections | 0.0554 |
Residual factor for significantly intense reflections | 0.052 |
Weighted residual factors for significantly intense reflections | 0.0737 |
Weighted residual factors for all reflections included in the refinement | 0.0747 |
Goodness-of-fit parameter for all reflections included in the refinement | 1.278 |
Diffraction radiation wavelength | 0.71073 Å |
Diffraction radiation type | MoKα |