Information card for entry 7035154
Formula | C27 H39 Co N5 O6 |
Calculated formula | C27 H39 Co N5 O6 |
SMILES | [Co]12([n]3ccc(cc3)C(C)(C)C)([n]3ccc(cc3)C(C)(C)C)([n]3ccc(C(C)(C)C)cc3)(ON(=[O]1)=O)ON(=[O]2)=O |
Title of publication | Slow magnetic relaxation in mononuclear seven-coordinate cobalt(ii) complexes with easy plane anisotropy. |
Authors of publication | Chen, Lei; Chen, Shu-Yang; Sun, Yi-Chen; Guo, Yu-Mei; Yu, Lu; Chen, Xue-Tai; Wang, Zhenxing; Ouyang, Z. W.; Song, You; Xue, Zi-Ling |
Journal of publication | Dalton transactions (Cambridge, England : 2003) |
Year of publication | 2015 |
Journal volume | 44 |
Journal issue | 25 |
Pages of publication | 11482 - 11490 |
a | 21.205 ± 0.003 Å |
b | 13.3419 ± 0.0018 Å |
c | 22.253 ± 0.003 Å |
α | 90° |
β | 95.851 ± 0.003° |
γ | 90° |
Cell volume | 6262.9 ± 1.5 Å3 |
Cell temperature | 296 ± 2 K |
Ambient diffraction temperature | 296 ± 2 K |
Number of distinct elements | 5 |
Space group number | 15 |
Hermann-Mauguin space group symbol | C 1 2/c 1 |
Hall space group symbol | -C 2yc |
Residual factor for all reflections | 0.1116 |
Residual factor for significantly intense reflections | 0.0781 |
Weighted residual factors for significantly intense reflections | 0.2391 |
Weighted residual factors for all reflections included in the refinement | 0.2706 |
Goodness-of-fit parameter for all reflections included in the refinement | 1.059 |
Diffraction radiation wavelength | 0.71073 Å |
Diffraction radiation type | MoKα |