Information card for entry 7035160
Formula | C85 H111 F6 Mn2 N16 O6 S4 |
Calculated formula | C79 H105 F6 Mn2 N16 O6 S4 |
Title of publication | Synthesis and characterization of M(ii) (M = Mn, Fe and Co) azafulvene complexes and their X3(-) derivatives. |
Authors of publication | Matson, Ellen M.; Park, Yun Ji; Bertke, Jeffery A.; Fout, Alison R. |
Journal of publication | Dalton transactions (Cambridge, England : 2003) |
Year of publication | 2015 |
Journal volume | 44 |
Journal issue | 22 |
Pages of publication | 10377 - 10384 |
a | 15.642 ± 0.0003 Å |
b | 23.5381 ± 0.0005 Å |
c | 25.1862 ± 0.0006 Å |
α | 90° |
β | 101.847 ± 0.001° |
γ | 90° |
Cell volume | 9075.6 ± 0.3 Å3 |
Cell temperature | 183 ± 2 K |
Ambient diffraction temperature | 183 ± 2 K |
Number of distinct elements | 7 |
Space group number | 14 |
Hermann-Mauguin space group symbol | P 1 21/c 1 |
Hall space group symbol | -P 2ybc |
Residual factor for all reflections | 0.0483 |
Residual factor for significantly intense reflections | 0.0407 |
Weighted residual factors for significantly intense reflections | 0.1047 |
Weighted residual factors for all reflections included in the refinement | 0.109 |
Goodness-of-fit parameter for all reflections included in the refinement | 1.047 |
Diffraction radiation wavelength | 1.54178 Å |
Diffraction radiation type | CuKα |