Information card for entry 7035166
Formula | C26 H35 Br2 N5 O2 Pd |
Calculated formula | C26 H35 Br2 N5 O2 Pd |
SMILES | [Pd](Br)(Br)([n]1nn(cc1c1ccccc1)CCOCCOC)=C1N(C(C)C)c2ccccc2N1C(C)C |
Title of publication | Biologically active [Pd2L4](4+) quadruply-stranded helicates: stability and cytotoxicity. |
Authors of publication | McNeill, Samantha M.; Preston, Dan; Lewis, James E. M.; Robert, Anja; Knerr-Rupp, Katrin; Graham, Danyon O.; Wright, James R.; Giles, Gregory I.; Crowley, James D. |
Journal of publication | Dalton transactions (Cambridge, England : 2003) |
Year of publication | 2015 |
Journal volume | 44 |
Journal issue | 24 |
Pages of publication | 11129 - 11136 |
a | 9.1029 ± 0.0001 Å |
b | 30.301 ± 0.0004 Å |
c | 10.3398 ± 0.0001 Å |
α | 90° |
β | 90° |
γ | 90° |
Cell volume | 2852 ± 0.06 Å3 |
Cell temperature | 100 ± 0.1 K |
Ambient diffraction temperature | 100 ± 0.1 K |
Number of distinct elements | 6 |
Space group number | 33 |
Hermann-Mauguin space group symbol | P n a 21 |
Hall space group symbol | P 2c -2n |
Residual factor for all reflections | 0.036 |
Residual factor for significantly intense reflections | 0.0347 |
Weighted residual factors for significantly intense reflections | 0.0874 |
Weighted residual factors for all reflections included in the refinement | 0.088 |
Goodness-of-fit parameter for all reflections included in the refinement | 1.052 |
Diffraction radiation wavelength | 1.54184 Å |
Diffraction radiation type | CuKα |