Information card for entry 7035203
Formula | C103 H140 Cl6 N4 P2 Ru2 |
Calculated formula | C103 H140 Cl6 N4 P2 Ru2 |
Title of publication | Ruthenium indenylidene complexes bearing N-alkyl/N-mesityl-substituted N-heterocyclic carbene ligands. |
Authors of publication | Yu, Baoyi; Hamad, Fatma B.; Sels, Bert; Van Hecke, Kristof; Verpoort, Francis |
Journal of publication | Dalton transactions (Cambridge, England : 2003) |
Year of publication | 2015 |
Journal volume | 44 |
Journal issue | 26 |
Pages of publication | 11835 - 11842 |
a | 33.7446 ± 0.0006 Å |
b | 14.667 ± 0.0003 Å |
c | 19.0468 ± 0.0003 Å |
α | 90° |
β | 94.2889 ± 0.0014° |
γ | 90° |
Cell volume | 9400.5 ± 0.3 Å3 |
Cell temperature | 100 ± 2 K |
Ambient diffraction temperature | 100 K |
Number of distinct elements | 6 |
Space group number | 15 |
Hermann-Mauguin space group symbol | C 1 2/c 1 |
Hall space group symbol | -C 2yc |
Residual factor for all reflections | 0.0991 |
Residual factor for significantly intense reflections | 0.0576 |
Weighted residual factors for significantly intense reflections | 0.108 |
Weighted residual factors for all reflections included in the refinement | 0.1252 |
Goodness-of-fit parameter for all reflections included in the refinement | 1.052 |
Diffraction radiation wavelength | 0.71073 Å |
Diffraction radiation type | MoKα |