Information card for entry 7035205
Formula | C30 H34 N4 Te2 |
Calculated formula | C30 H34 N4 Te2 |
SMILES | [Te]=C1N(c2ccccc2N1Cc1cc(ccc1)CN1C(=[Te])N(c2c1cccc2)CCCC)CCCC |
Title of publication | Bis(chalcogenones) as pincer ligands: isolation and Heck activity of the selone-ligated unsymmetrical C,C,Se-Pd pincer complex. |
Authors of publication | Ghavale, Ninad; Manjare, Sudesh T.; Singh, Harkesh B.; Butcher, Ray J. |
Journal of publication | Dalton transactions (Cambridge, England : 2003) |
Year of publication | 2015 |
Journal volume | 44 |
Journal issue | 26 |
Pages of publication | 11893 - 11900 |
a | 9.7586 ± 0.0003 Å |
b | 21.6201 ± 0.0013 Å |
c | 14.0678 ± 0.0005 Å |
α | 90° |
β | 93.418 ± 0.003° |
γ | 90° |
Cell volume | 2962.8 ± 0.2 Å3 |
Cell temperature | 296 ± 2 K |
Ambient diffraction temperature | 296 ± 2 K |
Number of distinct elements | 4 |
Space group number | 14 |
Hermann-Mauguin space group symbol | P 1 21/c 1 |
Hall space group symbol | -P 2ybc |
Residual factor for all reflections | 0.1177 |
Residual factor for significantly intense reflections | 0.0896 |
Weighted residual factors for significantly intense reflections | 0.2506 |
Weighted residual factors for all reflections included in the refinement | 0.2995 |
Goodness-of-fit parameter for all reflections included in the refinement | 1.055 |
Diffraction radiation wavelength | 0.71073 Å |
Diffraction radiation type | MoKα |