Information card for entry 7035210
Formula | C48 H54 Au4 N6 P4 |
Calculated formula | C48.024 H54.02 Au4 N6 P4 |
Title of publication | Organogold oligomers: exploiting iClick and aurophilic cluster formation to prepare solution stable Au4 repeating units. |
Authors of publication | Yang, Xi; Wang, Shanshan; Ghiviriga, Ion; Abboud, Khalil A.; Veige, Adam S. |
Journal of publication | Dalton transactions (Cambridge, England : 2003) |
Year of publication | 2015 |
Journal volume | 44 |
Journal issue | 25 |
Pages of publication | 11437 - 11443 |
a | 17.4114 ± 0.0012 Å |
b | 16.8969 ± 0.0012 Å |
c | 16.797 ± 0.0012 Å |
α | 90° |
β | 99.4513 ± 0.0014° |
γ | 90° |
Cell volume | 4874.6 ± 0.6 Å3 |
Cell temperature | 100 ± 2 K |
Ambient diffraction temperature | 100 ± 2 K |
Number of distinct elements | 5 |
Space group number | 14 |
Hermann-Mauguin space group symbol | P 1 21/c 1 |
Hall space group symbol | -P 2ybc |
Residual factor for all reflections | 0.0405 |
Residual factor for significantly intense reflections | 0.0339 |
Weighted residual factors for significantly intense reflections | 0.086 |
Weighted residual factors for all reflections included in the refinement | 0.0918 |
Goodness-of-fit parameter for all reflections included in the refinement | 1.163 |
Diffraction radiation wavelength | 0.71073 Å |
Diffraction radiation type | MoKα |