Information card for entry 7035216
Chemical name | TpyRu-Ag Polymer |
Formula | C36 H34 Ag F18 N10 O P3 Ru |
Calculated formula | C36 H34 Ag F18 N10 O P3 Ru |
Title of publication | A TpyRu(2+)-based bismetallopolymer and its performance in catalytic water oxidation (Tpy = 4-(p-methoxyphenyl)-2,2':6',2''-terpyridine). |
Authors of publication | Liu, Die; Liu, Qianqian; Li, Yiming; Wang, Meng; Yang, Xiaoyu; Wu, Tun; Moorefield, Charles; Wang, Pingshan; Newkome, George R. |
Journal of publication | Dalton transactions (Cambridge, England : 2003) |
Year of publication | 2015 |
Journal volume | 44 |
Journal issue | 25 |
Pages of publication | 11269 - 11273 |
a | 15.726 ± 0.003 Å |
b | 14.091 ± 0.003 Å |
c | 20.346 ± 0.004 Å |
α | 90° |
β | 93.632 ± 0.004° |
γ | 90° |
Cell volume | 4499.5 ± 1.6 Å3 |
Cell temperature | 100 ± 2 K |
Ambient diffraction temperature | 100 ± 2 K |
Number of distinct elements | 8 |
Space group number | 14 |
Hermann-Mauguin space group symbol | P 1 21/c 1 |
Hall space group symbol | -P 2ybc |
Residual factor for all reflections | 0.0621 |
Residual factor for significantly intense reflections | 0.0478 |
Weighted residual factors for significantly intense reflections | 0.1123 |
Weighted residual factors for all reflections included in the refinement | 0.1199 |
Goodness-of-fit parameter for all reflections included in the refinement | 1.047 |
Diffraction radiation wavelength | 0.71073 Å |
Diffraction radiation type | MoKα |