Information card for entry 7035218
Formula | C49 H32 Cl10 Fe2 N24 O S4 |
Calculated formula | C49 H32 Cl10 Fe2 N24 O S4 |
SMILES | [Fe]12([n]3[n]([Fe]([n]4cn(/N=C/c5c(Cl)ccc(Cl)c5)cn4)([n]4[n]2cn(/N=C/c2c(Cl)ccc(Cl)c2)c4)(N=C=S)(N=C=S)[n]2[n]1cn(/N=C/c1c(Cl)ccc(Cl)c1)c2)cn(/N=C/c1c(Cl)ccc(Cl)c1)c3)(N=C=S)([n]1ncn(/N=C/c2c(Cl)ccc(Cl)c2)c1)N=C=S.O |
Title of publication | Thermal and light induced spin crossover behavior of a dinuclear Fe(ii) compound. |
Authors of publication | Cheng, Xin; Yang, Qian; Gao, Chen; Wang, Bing-Wu; Shiga, Takuya; Oshio, Hiroki; Wang, Zhe-Ming; Gao, Song |
Journal of publication | Dalton transactions (Cambridge, England : 2003) |
Year of publication | 2015 |
Journal volume | 44 |
Journal issue | 25 |
Pages of publication | 11282 - 11285 |
a | 12.3828 ± 0.0004 Å |
b | 13.9794 ± 0.0005 Å |
c | 21.2486 ± 0.0008 Å |
α | 105.37 ± 0.003° |
β | 93.751 ± 0.003° |
γ | 105.82 ± 0.003° |
Cell volume | 3374.5 ± 0.2 Å3 |
Cell temperature | 180 K |
Ambient diffraction temperature | 180 K |
Number of distinct elements | 7 |
Space group number | 2 |
Hermann-Mauguin space group symbol | P -1 |
Hall space group symbol | -P 1 |
Residual factor for all reflections | 0.0679 |
Residual factor for significantly intense reflections | 0.0508 |
Weighted residual factors for significantly intense reflections | 0.1318 |
Weighted residual factors for all reflections included in the refinement | 0.1439 |
Goodness-of-fit parameter for all reflections included in the refinement | 1.027 |
Diffraction radiation wavelength | 0.71073 Å |
Diffraction radiation type | MoKα |