Information card for entry 7035221
Formula | C12 H16 Co2 N4 O13 |
Calculated formula | C12 H6 Co2 N4 O13 |
Title of publication | Towards a better understanding of honeycomb alternating magnetic networks. |
Authors of publication | Marino, Nadia; Armentano, Donatella; De Munno, Giovanni; Lloret, Francesc; Cano, Joan; Julve, Miguel |
Journal of publication | Dalton transactions (Cambridge, England : 2003) |
Year of publication | 2015 |
Journal volume | 44 |
Journal issue | 24 |
Pages of publication | 11040 - 11051 |
a | 9.4514 ± 0.0002 Å |
b | 16.7427 ± 0.0004 Å |
c | 6.1969 ± 0.0002 Å |
α | 90° |
β | 101.455 ± 0.001° |
γ | 90° |
Cell volume | 961.08 ± 0.04 Å3 |
Cell temperature | 296 ± 2 K |
Ambient diffraction temperature | 296 ± 2 K |
Number of distinct elements | 5 |
Space group number | 12 |
Hermann-Mauguin space group symbol | C 1 2/m 1 |
Hall space group symbol | -C 2y |
Residual factor for all reflections | 0.0456 |
Residual factor for significantly intense reflections | 0.0355 |
Weighted residual factors for significantly intense reflections | 0.0935 |
Weighted residual factors for all reflections included in the refinement | 0.1004 |
Goodness-of-fit parameter for all reflections included in the refinement | 1.076 |
Diffraction radiation wavelength | 0.71073 Å |
Diffraction radiation type | MoKα |