Information card for entry 7035233
Common name | JS7 (CH2Cl2/hexn) |
Formula | C13 H10 Au Cl2 F3 N2 |
Calculated formula | C13 H10 Au Cl2 F3 N2 |
SMILES | [Au]([n]1ccc(N(C)C)cc1)c1c(F)c(Cl)c(F)c(Cl)c1F |
Title of publication | The effect of gold(i) coordination on the dual fluorescence of 4-(dimethylamino)pyridine. |
Authors of publication | López-de-Luzuriaga, José M; Manso, Elena; Monge, Miguel; Olmos, M. Elena; Rodríguez-Castillo, María; Sampedro, Diego |
Journal of publication | Dalton transactions (Cambridge, England : 2003) |
Year of publication | 2015 |
Journal volume | 44 |
Journal issue | 24 |
Pages of publication | 11029 - 11039 |
a | 8.3077 ± 0.0006 Å |
b | 11.9099 ± 0.0009 Å |
c | 15.391 ± 0.001 Å |
α | 90° |
β | 105.228 ± 0.004° |
γ | 90° |
Cell volume | 1469.38 ± 0.18 Å3 |
Cell temperature | 120 ± 1 K |
Ambient diffraction temperature | 120 ± 1 K |
Number of distinct elements | 6 |
Space group number | 14 |
Hermann-Mauguin space group symbol | P 1 21/n 1 |
Hall space group symbol | -P 2yn |
Residual factor for all reflections | 0.0689 |
Residual factor for significantly intense reflections | 0.0388 |
Weighted residual factors for significantly intense reflections | 0.0853 |
Weighted residual factors for all reflections included in the refinement | 0.097 |
Goodness-of-fit parameter for all reflections included in the refinement | 1.051 |
Diffraction radiation probe | x-ray |
Diffraction radiation wavelength | 0.71073 Å |
Diffraction radiation type | MoKα |