Information card for entry 7035257
Formula | C55 H60 Al2 N2 O4 |
Calculated formula | C55 H60 Al2 N2 O4 |
Title of publication | Aluminum complexes based on pyridine substituted alcohols: synthesis, structure, and catalytic application in ROP. |
Authors of publication | Kireenko, Marina M.; Kuchuk, Ekaterina A.; Zaitsev, Kirill V.; Tafeenko, Viktor A.; Oprunenko, Yuri F.; Churakov, Andrei V.; Lermontova, Elmira Kh; Zaitseva, Galina S.; Karlov, Sergey S. |
Journal of publication | Dalton transactions (Cambridge, England : 2003) |
Year of publication | 2015 |
Journal volume | 44 |
Journal issue | 26 |
Pages of publication | 11963 - 11976 |
a | 21.108 ± 0.007 Å |
b | 14.946 ± 0.005 Å |
c | 19.243 ± 0.006 Å |
α | 90° |
β | 130.425 ± 0.004° |
γ | 90° |
Cell volume | 4621 ± 3 Å3 |
Cell temperature | 173 ± 2 K |
Ambient diffraction temperature | 173 ± 2 K |
Number of distinct elements | 5 |
Space group number | 15 |
Hermann-Mauguin space group symbol | C 1 2/c 1 |
Hall space group symbol | -C 2yc |
Residual factor for all reflections | 0.0972 |
Residual factor for significantly intense reflections | 0.0474 |
Weighted residual factors for significantly intense reflections | 0.0915 |
Weighted residual factors for all reflections included in the refinement | 0.1028 |
Goodness-of-fit parameter for all reflections included in the refinement | 0.968 |
Diffraction radiation wavelength | 0.71073 Å |
Diffraction radiation type | MoKα |