Information card for entry 7035264
Formula | C18 H24 Co3 N2 O20 |
Calculated formula | C18 H24 Co3 N2 O20 |
Title of publication | The effect of metal ions on photocatalytic performance based on an isostructural framework. |
Authors of publication | Shao, Zhichao; Huang, Chao; Han, Xiao; Wang, Huarui; Li, Angran; Han, Yanbing; Li, Kai; Hou, Hongwei; Fan, Yaoting |
Journal of publication | Dalton transactions (Cambridge, England : 2003) |
Year of publication | 2015 |
Journal volume | 44 |
Journal issue | 28 |
Pages of publication | 12832 - 12838 |
a | 7.4098 ± 0.0015 Å |
b | 8.4255 ± 0.0017 Å |
c | 10.209 ± 0.002 Å |
α | 82.46 ± 0.03° |
β | 83.41 ± 0.03° |
γ | 79.14 ± 0.03° |
Cell volume | 617.9 ± 0.2 Å3 |
Cell temperature | 293 ± 2 K |
Ambient diffraction temperature | 293 ± 2 K |
Number of distinct elements | 5 |
Space group number | 2 |
Hermann-Mauguin space group symbol | P -1 |
Hall space group symbol | -P 1 |
Residual factor for all reflections | 0.0385 |
Residual factor for significantly intense reflections | 0.0349 |
Weighted residual factors for significantly intense reflections | 0.0807 |
Weighted residual factors for all reflections included in the refinement | 0.0831 |
Goodness-of-fit parameter for all reflections included in the refinement | 1.094 |
Diffraction radiation wavelength | 0.71073 Å |
Diffraction radiation type | MoKα |