Information card for entry 7035273
Formula | C3 H7 Mn N O6 |
Calculated formula | C3 H7 Mn N O6 |
Title of publication | Probing ferroic transitions in a multiferroic framework family: a neutron diffraction study of the ammonium transition metal formates. |
Authors of publication | Lawler, James M. M.; Manuel, Pascal; Thompson, Amber L.; Saines, Paul J. |
Journal of publication | Dalton transactions (Cambridge, England : 2003) |
Year of publication | 2015 |
Journal volume | 44 |
Journal issue | 25 |
Pages of publication | 11613 - 11620 |
a | 6.8568 ± 0.0002 Å |
b | 9.3906 ± 0.0002 Å |
c | 10.7307 ± 0.0003 Å |
α | 90° |
β | 90° |
γ | 90° |
Cell volume | 690.94 ± 0.03 Å3 |
Cell temperature | 150 K |
Ambient diffraction temperature | 150 K |
Number of distinct elements | 5 |
Space group number | 33 |
Hermann-Mauguin space group symbol | P n a 21 |
Hall space group symbol | P 2c -2n |
Residual factor for all reflections | 0.0327 |
Residual factor for significantly intense reflections | 0.0275 |
Weighted residual factors for all reflections | 0.0641 |
Weighted residual factors for significantly intense reflections | 0.0617 |
Weighted residual factors for all reflections included in the refinement | 0.0641 |
Goodness-of-fit parameter for all reflections included in the refinement | 0.9596 |
Diffraction radiation wavelength | 0.71073 Å |
Diffraction radiation type | MoKα |