Information card for entry 7035276
Chemical name | CES |
Formula | C22 H22 O6 S |
Calculated formula | C22 H22 O6 S |
Title of publication | Improved selectivity for Pb(ii) by sulfur, selenium and tellurium analogues of 1,8-anthraquinone-18-crown-5: synthesis, spectroscopy, X-ray crystallography and computational studies. |
Authors of publication | Mariappan, Kadarkaraisamy; Alaparthi, Madhubabu; Hoffman, Mariah; Rama, Myriam Alcantar; Balasubramanian, Vinothini; John, Danielle M.; Sykes, Andrew G. |
Journal of publication | Dalton transactions (Cambridge, England : 2003) |
Year of publication | 2015 |
Journal volume | 44 |
Journal issue | 26 |
Pages of publication | 11774 - 11787 |
a | 14.3298 ± 0.0015 Å |
b | 8.144 ± 0.0008 Å |
c | 16.8072 ± 0.0017 Å |
α | 90° |
β | 104.209 ± 0.001° |
γ | 90° |
Cell volume | 1901.4 ± 0.3 Å3 |
Cell temperature | 100 ± 2 K |
Ambient diffraction temperature | 100 ± 2 K |
Number of distinct elements | 4 |
Space group number | 14 |
Hermann-Mauguin space group symbol | P 1 21/n 1 |
Hall space group symbol | -P 2yn |
Residual factor for all reflections | 0.0654 |
Residual factor for significantly intense reflections | 0.0423 |
Weighted residual factors for significantly intense reflections | 0.098 |
Weighted residual factors for all reflections included in the refinement | 0.1097 |
Goodness-of-fit parameter for all reflections included in the refinement | 1.031 |
Diffraction radiation wavelength | 0.71073 Å |
Diffraction radiation type | MoKα |