Information card for entry 7035310
Formula | C8 H74 As4 K20 Li2 O181 Tb6 W38 |
Calculated formula | C8 H6 As4 K20 Li2 O181 Tb6 W38 |
Title of publication | Double-malate bridging tri-lanthanoid cluster encapsulated arsenotungstates: syntheses, structures, luminescence and magnetic properties. |
Authors of publication | Ma, Pengtao; Wan, Rong; Si, Yanan; Hu, Feng; Wang, Yueyan; Niu, Jingyang; Wang, Jingping |
Journal of publication | Dalton transactions (Cambridge, England : 2003) |
Year of publication | 2015 |
Journal volume | 44 |
Journal issue | 25 |
Pages of publication | 11514 - 11523 |
a | 20.924 ± 0.003 Å |
b | 25.288 ± 0.004 Å |
c | 22.707 ± 0.004 Å |
α | 90° |
β | 112.785 ± 0.003° |
γ | 90° |
Cell volume | 11077 ± 3 Å3 |
Cell temperature | 296 ± 2 K |
Ambient diffraction temperature | 296.15 K |
Number of distinct elements | 8 |
Space group number | 14 |
Hermann-Mauguin space group symbol | P 1 21/n 1 |
Hall space group symbol | -P 2yn |
Residual factor for all reflections | 0.1146 |
Residual factor for significantly intense reflections | 0.0688 |
Weighted residual factors for significantly intense reflections | 0.1686 |
Weighted residual factors for all reflections included in the refinement | 0.2029 |
Goodness-of-fit parameter for all reflections included in the refinement | 1.012 |
Diffraction radiation wavelength | 0.71073 Å |
Diffraction radiation type | MoKα |