Information card for entry 7035318
Formula | C95.5 H85 N6 Y |
Calculated formula | C95.5 H85 N6 Y |
Title of publication | Cyclometalation and coupling of a rigid 4,5-bis(imino)acridanide pincer ligand on yttrium. |
Authors of publication | Wong, Edwin W. Y.; Emslie, David J. H. |
Journal of publication | Dalton transactions (Cambridge, England : 2003) |
Year of publication | 2015 |
Journal volume | 44 |
Journal issue | 25 |
Pages of publication | 11601 - 11612 |
a | 13.744 ± 0.002 Å |
b | 14.389 ± 0.002 Å |
c | 20.904 ± 0.003 Å |
α | 82.938 ± 0.004° |
β | 71.274 ± 0.004° |
γ | 74.886 ± 0.004° |
Cell volume | 3776.3 ± 0.9 Å3 |
Cell temperature | 100 K |
Ambient diffraction temperature | 100 K |
Number of distinct elements | 4 |
Space group number | 2 |
Hermann-Mauguin space group symbol | P -1 |
Hall space group symbol | -P 1 |
Residual factor for all reflections | 0.1272 |
Residual factor for significantly intense reflections | 0.0697 |
Weighted residual factors for all reflections | 0.1867 |
Weighted residual factors for significantly intense reflections | 0.1614 |
Weighted residual factors for all reflections included in the refinement | 0.1865 |
Goodness-of-fit parameter for all reflections included in the refinement | 0.921 |
Diffraction radiation wavelength | 0.71073 Å |
Diffraction radiation type | MoKα |