Information card for entry 7035360
Formula | C60 H58 B Ni P3 S |
Calculated formula | C60 H58 B Ni P3 S |
Title of publication | Mechanism of proton transfer to coordinated thiolates: encapsulation of acid stabilizes precursor intermediate. |
Authors of publication | Alwaaly, Ahmed; Clegg, William; Harrington, Ross W.; Petrou, Athinoula L.; Henderson, Richard A. |
Journal of publication | Dalton transactions (Cambridge, England : 2003) |
Year of publication | 2015 |
Journal volume | 44 |
Journal issue | 26 |
Pages of publication | 11977 - 11983 |
a | 11.4239 ± 0.0007 Å |
b | 14.8484 ± 0.0007 Å |
c | 16.8232 ± 0.0008 Å |
α | 96.983 ± 0.004° |
β | 106.192 ± 0.005° |
γ | 110.902 ± 0.005° |
Cell volume | 2481.2 ± 0.3 Å3 |
Cell temperature | 150 ± 2 K |
Ambient diffraction temperature | 150 ± 2 K |
Number of distinct elements | 6 |
Space group number | 2 |
Hermann-Mauguin space group symbol | P -1 |
Hall space group symbol | -P 1 |
Residual factor for all reflections | 0.0578 |
Residual factor for significantly intense reflections | 0.0381 |
Weighted residual factors for significantly intense reflections | 0.0747 |
Weighted residual factors for all reflections included in the refinement | 0.0834 |
Goodness-of-fit parameter for all reflections included in the refinement | 1.033 |
Diffraction radiation wavelength | 0.71073 Å |
Diffraction radiation type | MoKα |