Information card for entry 7035364
Common name | alonf1 |
Formula | C13 H17 Al F N O |
Calculated formula | C13 H17 Al F N O |
Title of publication | A closer look at ε-caprolactone polymerization catalyzed by alkyl aluminum complexes: the effect of induction period on overall catalytic activity. |
Authors of publication | Tseng, Hsi-Ching; Chiang, Michael Y.; Lu, Wei-Yi; Chen, Yen-Jen; Lian, Cheng-Jie; Chen, Yu-Hsieh; Tsai, Hsin-Yi; Lai, Yi-Chun; Chen, Hsuan-Ying |
Journal of publication | Dalton transactions (Cambridge, England : 2003) |
Year of publication | 2015 |
Journal volume | 44 |
Journal issue | 26 |
Pages of publication | 11763 - 11773 |
a | 17.4749 ± 0.0008 Å |
b | 10.041 ± 0.0004 Å |
c | 7.7635 ± 0.0003 Å |
α | 90° |
β | 90° |
γ | 90° |
Cell volume | 1362.23 ± 0.1 Å3 |
Cell temperature | 150 ± 2 K |
Ambient diffraction temperature | 150 ± 2 K |
Number of distinct elements | 6 |
Space group number | 62 |
Hermann-Mauguin space group symbol | P n m a |
Hall space group symbol | -P 2ac 2n |
Residual factor for all reflections | 0.0646 |
Residual factor for significantly intense reflections | 0.0541 |
Weighted residual factors for significantly intense reflections | 0.1659 |
Weighted residual factors for all reflections included in the refinement | 0.177 |
Goodness-of-fit parameter for all reflections included in the refinement | 1.007 |
Diffraction radiation wavelength | 0.71073 Å |
Diffraction radiation type | MoKα |