Information card for entry 7035378
Chemical name | (OC-6-33)-bis(acetonitrile)dichlorobis{{1-[4-ethyl(tetrahydro-1,4-diazino)]methyl}diphenylphosphine-?P}ruthenium(II) |
Formula | C43 H57 Cl5 N6 P2 Ru |
Calculated formula | C43 H57 Cl5 N6 P2 Ru |
Title of publication | New ruthenium(ii) coordination compounds possessing bidentate aminomethylphosphane ligands: synthesis, characterization and preliminary biological study in vitro. |
Authors of publication | Płotek, Michał; Starosta, Radosław; Komarnicka, Urszula K.; Skórska-Stania, Agnieszka; Jeżowska-Bojczuk, Małgorzata; Stochel, Grażyna; Kyzioł, Agnieszka |
Journal of publication | Dalton transactions (Cambridge, England : 2003) |
Year of publication | 2015 |
Journal volume | 44 |
Journal issue | 31 |
Pages of publication | 13969 - 13978 |
a | 9.2987 ± 0.0006 Å |
b | 25.238 ± 0.002 Å |
c | 10.4915 ± 0.0007 Å |
α | 90° |
β | 100.394 ± 0.005° |
γ | 90° |
Cell volume | 2421.7 ± 0.3 Å3 |
Cell temperature | 293 ± 2 K |
Ambient diffraction temperature | 293 ± 2 K |
Number of distinct elements | 6 |
Space group number | 11 |
Hermann-Mauguin space group symbol | P 1 21/m 1 |
Hall space group symbol | -P 2yb |
Residual factor for all reflections | 0.0599 |
Residual factor for significantly intense reflections | 0.0465 |
Weighted residual factors for significantly intense reflections | 0.0989 |
Weighted residual factors for all reflections included in the refinement | 0.1054 |
Goodness-of-fit parameter for all reflections included in the refinement | 1.023 |
Diffraction radiation probe | x-ray |
Diffraction radiation wavelength | 0.71073 Å |
Diffraction radiation type | MoKα |