Information card for entry 7035389
Formula | C42 H245 Cu27 N38 O270 P6 W60.5 |
Calculated formula | C42 H163 Cu27 N38 O270 P6 W60.5 |
Title of publication | A novel poly(polyoxometalate) built by {Cu9}/{Cu5} clusters and {PW9}/{PW10}/{PW11} lacunary fragments. |
Authors of publication | Fang, Wei-Hui; Wang, Wei-Dong; Yang, Guo-Yu |
Journal of publication | Dalton transactions (Cambridge, England : 2003) |
Year of publication | 2015 |
Journal volume | 44 |
Journal issue | 28 |
Pages of publication | 12546 - 12549 |
a | 12.159 ± 0.003 Å |
b | 22.224 ± 0.004 Å |
c | 30.636 ± 0.006 Å |
α | 92.391 ± 0.003° |
β | 97.373 ± 0.003° |
γ | 95.874 ± 0.003° |
Cell volume | 8154 ± 3 Å3 |
Cell temperature | 293 ± 2 K |
Ambient diffraction temperature | 293 ± 2 K |
Number of distinct elements | 7 |
Space group number | 2 |
Hermann-Mauguin space group symbol | P -1 |
Hall space group symbol | -P 1 |
Residual factor for all reflections | 0.0826 |
Residual factor for significantly intense reflections | 0.0599 |
Weighted residual factors for significantly intense reflections | 0.1445 |
Weighted residual factors for all reflections included in the refinement | 0.1604 |
Goodness-of-fit parameter for all reflections included in the refinement | 1.071 |
Diffraction radiation wavelength | 0.71073 Å |
Diffraction radiation type | MoKα |