Information card for entry 7035412
Mineral name |
Perovskite |
Formula |
Ba8 Nb5.1 O24 Sb0.9 Zn |
Calculated formula |
Ba8 Nb5.1 O24 Sb0.9 Zn |
Title of publication |
Nanometer-scale separation of d(10) Zn(2+)-layers and twin-shift competition in Ba8ZnNb6O24-based 8-layered hexagonal perovskites. |
Authors of publication |
Lu, Fengqi; Wang, Xiaoming; Pan, Zhengwei; Pan, Fengjuan; Chai, Shiqiang; Liang, Chaolun; Wang, Quanchao; Wang, Jing; Fang, Liang; Kuang, Xiaojun; Jing, Xiping |
Journal of publication |
Dalton transactions (Cambridge, England : 2003) |
Year of publication |
2015 |
Journal volume |
44 |
Journal issue |
29 |
Pages of publication |
13173 - 13185 |
a |
10.08267 ± 0.00002 Å |
b |
10.08267 ± 0.00002 Å |
c |
19.05159 ± 0.00006 Å |
α |
90° |
β |
90° |
γ |
120° |
Cell volume |
1677.31 ± 0.007 Å3 |
Number of distinct elements |
5 |
Space group number |
185 |
Hermann-Mauguin space group symbol |
P 63 c m |
Hall space group symbol |
P 6c -2 |
Yes |
No |
No |