Information card for entry 7035430
Formula | C10 H20 Cl3.1 Mo O2.9 |
Calculated formula | C10 H20 Cl3.098 Mo O2.902 |
Title of publication | Is bond stretch isomerism in mononuclear transition metal complexes a real issue? The misleading case of the MoCl5/tetrahydropyran reaction system. |
Authors of publication | Di Nicola, Francesco Paolo; Lanzi, Massimiliano; Marchetti, Fabio; Pampaloni, Guido; Zacchini, Stefano |
Journal of publication | Dalton transactions (Cambridge, England : 2003) |
Year of publication | 2015 |
Journal volume | 44 |
Journal issue | 28 |
Pages of publication | 12653 - 12659 |
a | 34.417 ± 0.006 Å |
b | 7.3606 ± 0.0013 Å |
c | 12.169 ± 0.002 Å |
α | 90° |
β | 90° |
γ | 90° |
Cell volume | 3082.8 ± 0.9 Å3 |
Cell temperature | 100 ± 2 K |
Ambient diffraction temperature | 100 ± 2 K |
Number of distinct elements | 5 |
Space group number | 43 |
Hermann-Mauguin space group symbol | F d d 2 |
Hall space group symbol | F 2 -2d |
Residual factor for all reflections | 0.0242 |
Residual factor for significantly intense reflections | 0.022 |
Weighted residual factors for significantly intense reflections | 0.053 |
Weighted residual factors for all reflections included in the refinement | 0.054 |
Goodness-of-fit parameter for all reflections included in the refinement | 1.084 |
Diffraction radiation wavelength | 0.71073 Å |
Diffraction radiation type | MoKα |