Information card for entry 7035432
Formula | C10 H20 Cl3.08 Mo O2.92 |
Calculated formula | C10 H20 Cl3.086 Mo O2.914 |
Title of publication | Is bond stretch isomerism in mononuclear transition metal complexes a real issue? The misleading case of the MoCl5/tetrahydropyran reaction system. |
Authors of publication | Di Nicola, Francesco Paolo; Lanzi, Massimiliano; Marchetti, Fabio; Pampaloni, Guido; Zacchini, Stefano |
Journal of publication | Dalton transactions (Cambridge, England : 2003) |
Year of publication | 2015 |
Journal volume | 44 |
Journal issue | 28 |
Pages of publication | 12653 - 12659 |
a | 34.434 ± 0.003 Å |
b | 7.3641 ± 0.0007 Å |
c | 12.1545 ± 0.0011 Å |
α | 90° |
β | 90° |
γ | 90° |
Cell volume | 3082.1 ± 0.5 Å3 |
Cell temperature | 100 ± 2 K |
Ambient diffraction temperature | 100 ± 2 K |
Number of distinct elements | 5 |
Space group number | 43 |
Hermann-Mauguin space group symbol | F d d 2 |
Hall space group symbol | F 2 -2d |
Residual factor for all reflections | 0.0176 |
Residual factor for significantly intense reflections | 0.0171 |
Weighted residual factors for significantly intense reflections | 0.0396 |
Weighted residual factors for all reflections included in the refinement | 0.0398 |
Goodness-of-fit parameter for all reflections included in the refinement | 1.066 |
Diffraction radiation wavelength | 0.71073 Å |
Diffraction radiation type | MoKα |