Information card for entry 7035438
Formula | C86 H71 N13 O4 P4 |
Calculated formula | C86 H71 N13 O4 P4 |
Title of publication | Double [3 + 2]-dimerisation cascade synthesis of bis(triazolyl)bisphosphanes, a new scaffold for bidentate bisphosphanes. |
Authors of publication | Laborde, Coralie; Wei, Muh-Mei; van der Lee, Arie; Deydier, Eric; Daran, Jean-Claude; Volle, Jean-Noël; Poli, Rinaldo; Pirat, Jean-Luc; Manoury, Eric; Virieux, David |
Journal of publication | Dalton transactions (Cambridge, England : 2003) |
Year of publication | 2015 |
Journal volume | 44 |
Journal issue | 28 |
Pages of publication | 12539 - 12545 |
a | 12.8008 ± 0.0002 Å |
b | 16.6628 ± 0.0003 Å |
c | 17.8668 ± 0.0003 Å |
α | 90° |
β | 99.683 ± 0.0017° |
γ | 90° |
Cell volume | 3756.65 ± 0.11 Å3 |
Cell temperature | 175 K |
Ambient diffraction temperature | 175 K |
Number of distinct elements | 5 |
Space group number | 14 |
Hermann-Mauguin space group symbol | P 1 21/n 1 |
Hall space group symbol | -P 2yn |
Residual factor for all reflections | 0.0534 |
Residual factor for significantly intense reflections | 0.0445 |
Weighted residual factors for all reflections | 0.1425 |
Weighted residual factors for significantly intense reflections | 0.1325 |
Weighted residual factors for all reflections included in the refinement | 0.1425 |
Goodness-of-fit parameter for all reflections included in the refinement | 0.8507 |
Diffraction radiation wavelength | 0.71073 Å |
Diffraction radiation type | MoKα |