Information card for entry 7035442
Formula | C42 H34 Cl2 N6 P2 Pt |
Calculated formula | C42 H34 Cl2 N6 P2 Pt |
SMILES | [Pt]1(Cl)(Cl)[P](c2nnn(c2c2n(nnc2[P]1(c1ccccc1)c1ccccc1)Cc1ccccc1)Cc1ccccc1)(c1ccccc1)c1ccccc1 |
Title of publication | Double [3 + 2]-dimerisation cascade synthesis of bis(triazolyl)bisphosphanes, a new scaffold for bidentate bisphosphanes. |
Authors of publication | Laborde, Coralie; Wei, Muh-Mei; van der Lee, Arie; Deydier, Eric; Daran, Jean-Claude; Volle, Jean-Noël; Poli, Rinaldo; Pirat, Jean-Luc; Manoury, Eric; Virieux, David |
Journal of publication | Dalton transactions (Cambridge, England : 2003) |
Year of publication | 2015 |
Journal volume | 44 |
Journal issue | 28 |
Pages of publication | 12539 - 12545 |
a | 25.778 ± 0.005 Å |
b | 17.954 ± 0.005 Å |
c | 19.364 ± 0.005 Å |
α | 90 ± 0.005° |
β | 104.467 ± 0.005° |
γ | 90 ± 0.005° |
Cell volume | 8678 ± 4 Å3 |
Cell temperature | 180 ± 2 K |
Ambient diffraction temperature | 180 ± 2 K |
Number of distinct elements | 6 |
Space group number | 14 |
Hermann-Mauguin space group symbol | P 1 21/c 1 |
Hall space group symbol | -P 2ybc |
Residual factor for all reflections | 0.0455 |
Residual factor for significantly intense reflections | 0.0341 |
Weighted residual factors for significantly intense reflections | 0.077 |
Weighted residual factors for all reflections included in the refinement | 0.081 |
Goodness-of-fit parameter for all reflections included in the refinement | 1.043 |
Diffraction radiation wavelength | 0.71073 Å |
Diffraction radiation type | MoKα |