Information card for entry 7035445
Formula | C49 H62 B Fe K N2 O6 |
Calculated formula | C49 H62 B Fe K N2 O6 |
Title of publication | Extension of conjugation: probing anion binding strength and reporter mechanisms in (phenyl)cyclopentadienyl and indenyl receptors. |
Authors of publication | Tirfoin, Rémi; Abdalla, Joseph A. B.; Aldridge, Simon |
Journal of publication | Dalton transactions (Cambridge, England : 2003) |
Year of publication | 2015 |
Journal volume | 44 |
Journal issue | 29 |
Pages of publication | 13049 - 13059 |
a | 13.0828 ± 0.0002 Å |
b | 14.7366 ± 0.0002 Å |
c | 14.9552 ± 0.0003 Å |
α | 60.8147 ± 0.0007° |
β | 72.4211 ± 0.0007° |
γ | 69.3532 ± 0.0009° |
Cell volume | 2325.53 ± 0.07 Å3 |
Cell temperature | 150 K |
Ambient diffraction temperature | 150 K |
Number of distinct elements | 7 |
Space group number | 2 |
Hermann-Mauguin space group symbol | P -1 |
Hall space group symbol | -P 1 |
Residual factor for all reflections | 0.0755 |
Residual factor for significantly intense reflections | 0.0459 |
Weighted residual factors for all reflections | 0.1215 |
Weighted residual factors for significantly intense reflections | 0.0938 |
Weighted residual factors for all reflections included in the refinement | 0.1215 |
Goodness-of-fit parameter for all reflections included in the refinement | 0.9555 |
Diffraction radiation wavelength | 0.71073 Å |
Diffraction radiation type | MoKα |