Information card for entry 7035449
Formula | C34 H35 B Fe |
Calculated formula | C34 H35 B Fe |
Title of publication | Extension of conjugation: probing anion binding strength and reporter mechanisms in (phenyl)cyclopentadienyl and indenyl receptors. |
Authors of publication | Tirfoin, Rémi; Abdalla, Joseph A. B.; Aldridge, Simon |
Journal of publication | Dalton transactions (Cambridge, England : 2003) |
Year of publication | 2015 |
Journal volume | 44 |
Journal issue | 29 |
Pages of publication | 13049 - 13059 |
a | 7.4511 ± 0.0001 Å |
b | 11.4935 ± 0.0002 Å |
c | 16.8162 ± 0.0003 Å |
α | 71.4209 ± 0.0008° |
β | 83.5154 ± 0.0008° |
γ | 77.8551 ± 0.0008° |
Cell volume | 1332.88 ± 0.04 Å3 |
Cell temperature | 150 K |
Ambient diffraction temperature | 150 K |
Number of distinct elements | 4 |
Space group number | 2 |
Hermann-Mauguin space group symbol | P -1 |
Hall space group symbol | -P 1 |
Residual factor for all reflections | 0.0659 |
Residual factor for significantly intense reflections | 0.0454 |
Weighted residual factors for all reflections | 0.1117 |
Weighted residual factors for significantly intense reflections | 0.0927 |
Weighted residual factors for all reflections included in the refinement | 0.1117 |
Goodness-of-fit parameter for all reflections included in the refinement | 0.929 |
Diffraction radiation wavelength | 0.71073 Å |
Diffraction radiation type | MoKα |