Information card for entry 7035474
Formula | C50 H54 B F24 Li N6 |
Calculated formula | C50 H54 B F24 Li N6 |
Title of publication | Aza-macrocyclic complexes of the Group 1 cations - synthesis, structures and density functional theory study. |
Authors of publication | Dyke, John; Levason, William; Light, Mark E.; Pugh, David; Reid, Gillian; Bhakhoa, Hanusha; Ramasami, Ponnadurai; Rhyman, Lydia |
Journal of publication | Dalton transactions (Cambridge, England : 2003) |
Year of publication | 2015 |
Journal volume | 44 |
Journal issue | 31 |
Pages of publication | 13853 - 13866 |
a | 13.18 ± 0.003 Å |
b | 16.887 ± 0.004 Å |
c | 24.3 ± 0.005 Å |
α | 90° |
β | 92.212 ± 0.003° |
γ | 90° |
Cell volume | 5404 ± 2 Å3 |
Cell temperature | 100 ± 2 K |
Ambient diffraction temperature | 100 ± 2 K |
Number of distinct elements | 6 |
Space group number | 14 |
Hermann-Mauguin space group symbol | P 1 21/c 1 |
Hall space group symbol | -P 2ybc |
Residual factor for all reflections | 0.1402 |
Residual factor for significantly intense reflections | 0.0836 |
Weighted residual factors for significantly intense reflections | 0.1998 |
Weighted residual factors for all reflections included in the refinement | 0.2379 |
Goodness-of-fit parameter for all reflections included in the refinement | 1.02 |
Diffraction radiation wavelength | 0.71073 Å |
Diffraction radiation type | MoKα |