Information card for entry 7035487
Formula | C18 H26 Cl4 Mo N3 O |
Calculated formula | C18 H25.805 Cl4 Mo N3 O |
Title of publication | Molybdenum complexes derived from the oxydianiline [(2-NH2C6H4)2O]: synthesis, characterization and ε-caprolactone ROP capability. |
Authors of publication | Yang, Wenxue; Zhao, Ke-Qing; Redshaw, Carl; Elsegood, Mark R. J. |
Journal of publication | Dalton transactions (Cambridge, England : 2003) |
Year of publication | 2015 |
Journal volume | 44 |
Journal issue | 29 |
Pages of publication | 13133 - 13140 |
a | 12.212 ± 0.0007 Å |
b | 11.9077 ± 0.0007 Å |
c | 17.0761 ± 0.0009 Å |
α | 90° |
β | 102.014 ± 0.0009° |
γ | 90° |
Cell volume | 2428.8 ± 0.2 Å3 |
Cell temperature | 150 ± 2 K |
Ambient diffraction temperature | 150 ± 2 K |
Number of distinct elements | 6 |
Space group number | 14 |
Hermann-Mauguin space group symbol | P 1 21/c 1 |
Hall space group symbol | -P 2ybc |
Residual factor for all reflections | 0.0671 |
Residual factor for significantly intense reflections | 0.0447 |
Weighted residual factors for significantly intense reflections | 0.1218 |
Weighted residual factors for all reflections included in the refinement | 0.1372 |
Goodness-of-fit parameter for all reflections included in the refinement | 1.07 |
Diffraction radiation wavelength | 0.71073 Å |
Diffraction radiation type | MoKα |