Information card for entry 7035497
Formula | C26 H39 B Br5 Ir N6 O2 |
Calculated formula | C26 H39 B Br5 Ir N6 O2 |
Title of publication | Synthesis of Ir(iii) complexes with Tp(Me2) and acac ligands and their reactivity with electrophiles. |
Authors of publication | Morales-Cerón, Judith P; Salazar-Pereda, Verónica; Mendoza-Espinosa, Daniel; Alvarado-Rodríguez, José G; Cruz-Borbolla, Julián; Andrade-López, Noemí; Vásquez-Pérez, José M |
Journal of publication | Dalton transactions (Cambridge, England : 2003) |
Year of publication | 2015 |
Journal volume | 44 |
Journal issue | 31 |
Pages of publication | 13881 - 13889 |
a | 11.8577 ± 0.0005 Å |
b | 16.3125 ± 0.0007 Å |
c | 18.7394 ± 0.0008 Å |
α | 90° |
β | 103.237 ± 0.001° |
γ | 90° |
Cell volume | 3528.4 ± 0.3 Å3 |
Cell temperature | 293 ± 2 K |
Ambient diffraction temperature | 293 ± 2 K |
Number of distinct elements | 7 |
Space group number | 14 |
Hermann-Mauguin space group symbol | P 1 21/c 1 |
Hall space group symbol | -P 2ybc |
Residual factor for all reflections | 0.0805 |
Residual factor for significantly intense reflections | 0.0601 |
Weighted residual factors for significantly intense reflections | 0.1526 |
Weighted residual factors for all reflections included in the refinement | 0.1674 |
Goodness-of-fit parameter for all reflections included in the refinement | 0.994 |
Diffraction radiation wavelength | 0.71073 Å |
Diffraction radiation type | MoKα |