Information card for entry 7035523
Formula | C22 H24 N10 O24 Yb2 |
Calculated formula | C22 H22 N10 O24 Yb2 |
Title of publication | Structural features and near infra-red (NIR) luminescence of isomeric Yb(iii) bipyridyl-N,N'-dioxide coordination polymers. |
Authors of publication | Sequeira, Gail M.; Tan, Wayne Y.; Moore, Evan G. |
Journal of publication | Dalton transactions (Cambridge, England : 2003) |
Year of publication | 2015 |
Journal volume | 44 |
Journal issue | 29 |
Pages of publication | 13378 - 13383 |
a | 15.319 ± 0.002 Å |
b | 8.1376 ± 0.0013 Å |
c | 13.8906 ± 0.0016 Å |
α | 90° |
β | 93.458 ± 0.01° |
γ | 90° |
Cell volume | 1728.4 ± 0.4 Å3 |
Cell temperature | 190 ± 2 K |
Ambient diffraction temperature | 190 ± 2 K |
Number of distinct elements | 5 |
Space group number | 15 |
Hermann-Mauguin space group symbol | C 1 2/c 1 |
Hall space group symbol | -C 2yc |
Residual factor for all reflections | 0.0896 |
Residual factor for significantly intense reflections | 0.0516 |
Weighted residual factors for significantly intense reflections | 0.0918 |
Weighted residual factors for all reflections included in the refinement | 0.1036 |
Goodness-of-fit parameter for all reflections included in the refinement | 0.971 |
Diffraction radiation wavelength | 0.71073 Å |
Diffraction radiation type | MoKα |