Information card for entry 7035525
Formula | C22 H24 N10 O24 Yb2 |
Calculated formula | C22 H22 N10 O24 Yb2 |
Title of publication | Structural features and near infra-red (NIR) luminescence of isomeric Yb(iii) bipyridyl-N,N'-dioxide coordination polymers. |
Authors of publication | Sequeira, Gail M.; Tan, Wayne Y.; Moore, Evan G. |
Journal of publication | Dalton transactions (Cambridge, England : 2003) |
Year of publication | 2015 |
Journal volume | 44 |
Journal issue | 29 |
Pages of publication | 13378 - 13383 |
a | 34.4809 ± 0.0013 Å |
b | 7.811 ± 0.0017 Å |
c | 15.8568 ± 0.0006 Å |
α | 90° |
β | 124.966 ± 0.001° |
γ | 90° |
Cell volume | 3499.8 ± 0.8 Å3 |
Cell temperature | 190 ± 2 K |
Ambient diffraction temperature | 190 ± 2 K |
Number of distinct elements | 5 |
Space group number | 15 |
Hermann-Mauguin space group symbol | C 1 2/c 1 |
Hall space group symbol | -C 2yc |
Residual factor for all reflections | 0.0266 |
Residual factor for significantly intense reflections | 0.0245 |
Weighted residual factors for significantly intense reflections | 0.063 |
Weighted residual factors for all reflections included in the refinement | 0.0652 |
Goodness-of-fit parameter for all reflections included in the refinement | 1.035 |
Diffraction radiation wavelength | 1.5418 Å |
Diffraction radiation type | CuKα |