Information card for entry 7035552
Chemical name | catena-(bis(m3-iodo)-(m2-piperazine)-copper(i)) |
Formula | C4 H10 Cu2 I2 N2 |
Calculated formula | C4 H10 Cu2 I2 N2 |
Title of publication | Dual luminescence in solid CuI(piperazine): hypothesis of an emissive 1-D delocalized excited state. |
Authors of publication | Maini, L.; Braga, D.; Mazzeo, P. P.; Maschio, L.; Rérat, M; Manet, I.; Ventura, B. |
Journal of publication | Dalton transactions (Cambridge, England : 2003) |
Year of publication | 2015 |
Journal volume | 44 |
Journal issue | 29 |
Pages of publication | 13003 - 13006 |
a | 9.2363 ± 0.0006 Å |
b | 15.39 ± 0.001 Å |
c | 7.057 ± 0.0005 Å |
α | 90° |
β | 103.725 ± 0.008° |
γ | 90° |
Cell volume | 974.49 ± 0.12 Å3 |
Cell temperature | 150 ± 2 K |
Ambient diffraction temperature | 150 ± 2 K |
Number of distinct elements | 5 |
Space group number | 15 |
Hermann-Mauguin space group symbol | C 1 2/c 1 |
Hall space group symbol | -C 2yc |
Residual factor for all reflections | 0.0328 |
Residual factor for significantly intense reflections | 0.0281 |
Weighted residual factors for significantly intense reflections | 0.0677 |
Weighted residual factors for all reflections included in the refinement | 0.0687 |
Goodness-of-fit parameter for all reflections included in the refinement | 1.099 |
Diffraction radiation probe | x-ray |
Diffraction radiation wavelength | 0.71073 Å |
Diffraction radiation type | MoKα |