Information card for entry 7035557
Common name | [Cu(L)(eamide)] |
Formula | C17 H17 Cu N3 O5 |
Calculated formula | C17 H17 Cu N3 O5 |
Title of publication | Molecular Pac-Man and Tacos: layered Cu(ii) cages from ligands with high binding site concentrations. |
Authors of publication | McDonald, Cecelia; Williams, David W.; Comar, Priyanka; Coles, Simon J.; Keene, Tony D.; Pitak, Mateusz B.; Brechin, Euan K.; Jones, Leigh F. |
Journal of publication | Dalton transactions (Cambridge, England : 2003) |
Year of publication | 2015 |
Journal volume | 44 |
Journal issue | 29 |
Pages of publication | 13359 - 13368 |
a | 36.1459 ± 0.0012 Å |
b | 5.22 ± 0.0002 Å |
c | 18.0068 ± 0.0007 Å |
α | 90° |
β | 101.697 ± 0.003° |
γ | 90° |
Cell volume | 3327 ± 0.2 Å3 |
Cell temperature | 150 ± 2 K |
Ambient diffraction temperature | 150 ± 2 K |
Number of distinct elements | 5 |
Space group number | 15 |
Hermann-Mauguin space group symbol | C 1 2/c 1 |
Hall space group symbol | -C 2yc |
Residual factor for all reflections | 0.0401 |
Residual factor for significantly intense reflections | 0.0315 |
Weighted residual factors for significantly intense reflections | 0.0801 |
Weighted residual factors for all reflections included in the refinement | 0.0842 |
Goodness-of-fit parameter for all reflections included in the refinement | 1.066 |
Diffraction radiation wavelength | 0.7107 Å |
Diffraction radiation type | MoKα |