Information card for entry 7035565
Formula | C19 H18 Cu2 N4 O11 |
Calculated formula | C19 H18 Cu2 N4 O11 |
Title of publication | Aminopyridine derivatives controlled the assembly and various properties of Cu-BTC metal-organic frameworks. |
Authors of publication | Wang, Xiuli; Le, Mao; Lin, Hongyan; Luan, Jian; Liu, Guocheng; Liu, Danna |
Journal of publication | Dalton transactions (Cambridge, England : 2003) |
Year of publication | 2015 |
Journal volume | 44 |
Journal issue | 31 |
Pages of publication | 14008 - 14018 |
a | 10.772 ± 0.0004 Å |
b | 21.7524 ± 0.0009 Å |
c | 9.8578 ± 0.0004 Å |
α | 90° |
β | 111.728 ± 0.001° |
γ | 90° |
Cell volume | 2145.74 ± 0.15 Å3 |
Cell temperature | 296 ± 2 K |
Ambient diffraction temperature | 296 ± 2 K |
Number of distinct elements | 5 |
Space group number | 14 |
Hermann-Mauguin space group symbol | P 1 21/c 1 |
Hall space group symbol | -P 2ybc |
Residual factor for all reflections | 0.0452 |
Residual factor for significantly intense reflections | 0.033 |
Weighted residual factors for significantly intense reflections | 0.0849 |
Weighted residual factors for all reflections included in the refinement | 0.0904 |
Goodness-of-fit parameter for all reflections included in the refinement | 1.03 |
Diffraction radiation wavelength | 0.71073 Å |
Diffraction radiation type | MoKα |