Information card for entry 7035567
Chemical name | [Sr(emeamp)(tmhd)]3 |
Formula | C20 H39 N O4 Sr |
Calculated formula | C20 H39 N O4 Sr |
Title of publication | Heteroleptic strontium complexes stabilized by donor-functionalized alkoxide and β-diketonate ligands. |
Authors of publication | George, Sheby Mary; Kim, Hyo-Suk; Oh, Hyun Ji; Lah, Myoung Soo; Jeon, Dong Ju; Park, Bo Keun; Han, Jeong Hwan; Kim, Chang Gyoun; Chung, Taek-Mo |
Journal of publication | Dalton transactions (Cambridge, England : 2003) |
Year of publication | 2015 |
Journal volume | 44 |
Journal issue | 31 |
Pages of publication | 14042 - 14053 |
a | 14.9083 ± 0.0002 Å |
b | 15.5225 ± 0.0002 Å |
c | 17.1464 ± 0.0002 Å |
α | 78.934 ± 0.001° |
β | 85.255 ± 0.001° |
γ | 63.586 ± 0.001° |
Cell volume | 3487.59 ± 0.08 Å3 |
Cell temperature | 100 ± 1 K |
Ambient diffraction temperature | 100 ± 1 K |
Number of distinct elements | 5 |
Space group number | 2 |
Hermann-Mauguin space group symbol | P -1 |
Hall space group symbol | -P 1 |
Residual factor for all reflections | 0.0948 |
Residual factor for significantly intense reflections | 0.0462 |
Weighted residual factors for significantly intense reflections | 0.077 |
Weighted residual factors for all reflections included in the refinement | 0.0918 |
Goodness-of-fit parameter for all reflections included in the refinement | 1.032 |
Diffraction radiation wavelength | 0.71073 Å |
Diffraction radiation type | MoKα |