Information card for entry 7035581
Formula | C36 H54 B2 N O2 P2 S Si Tb |
Calculated formula | C36 H54 B2 N O2 P2 S Si Tb |
Title of publication | Alkynyl-functionalized gold NHC complexes and their coinage metal clusters. |
Authors of publication | Kiefer, Claude; Bestgen, Sebastian; Gamer, Michael T.; Lebedkin, Sergei; Kappes, Manfred M.; Roesky, Peter W. |
Journal of publication | Dalton transactions (Cambridge, England : 2003) |
Year of publication | 2015 |
Journal volume | 44 |
Journal issue | 30 |
Pages of publication | 13662 - 13670 |
a | 9.8355 ± 0.0003 Å |
b | 11.4119 ± 0.0004 Å |
c | 36.158 ± 0.0011 Å |
α | 90° |
β | 97.657 ± 0.002° |
γ | 90° |
Cell volume | 4022.2 ± 0.2 Å3 |
Cell temperature | 150 K |
Ambient diffraction temperature | 150 K |
Number of distinct elements | 9 |
Space group number | 14 |
Hermann-Mauguin space group symbol | P 1 21/n 1 |
Hall space group symbol | -P 2yn |
Residual factor for all reflections | 0.1072 |
Residual factor for significantly intense reflections | 0.0531 |
Weighted residual factors for significantly intense reflections | 0.1162 |
Weighted residual factors for all reflections included in the refinement | 0.1384 |
Goodness-of-fit parameter for all reflections included in the refinement | 0.891 |
Diffraction radiation wavelength | 0.71073 Å |
Diffraction radiation type | MoKα |