Information card for entry 7035591
Formula | C43 H40 F6 N P3 Ru |
Calculated formula | C43 H40 F6 N P3 Ru |
Title of publication | Syntheses, structural characterisation and electronic structures of some simple acyclic amino carbene complexes. |
Authors of publication | Eaves, Samantha G.; Yufit, Dmitry S.; Skelton, Brian W.; Howard, Judith A. K.; Low, Paul J. |
Journal of publication | Dalton transactions (Cambridge, England : 2003) |
Year of publication | 2015 |
Journal volume | 44 |
Journal issue | 32 |
Pages of publication | 14341 - 14348 |
a | 14.287 ± 0.002 Å |
b | 21.502 ± 0.004 Å |
c | 37.246 ± 0.006 Å |
α | 90° |
β | 90° |
γ | 90° |
Cell volume | 11442 ± 3 Å3 |
Cell temperature | 120 K |
Ambient diffraction temperature | 120 K |
Number of distinct elements | 6 |
Space group number | 19 |
Hermann-Mauguin space group symbol | P 21 21 21 |
Hall space group symbol | P 2ac 2ab |
Residual factor for all reflections | 0.0679 |
Residual factor for significantly intense reflections | 0.0528 |
Weighted residual factors for significantly intense reflections | 0.1167 |
Weighted residual factors for all reflections included in the refinement | 0.1265 |
Goodness-of-fit parameter for all reflections included in the refinement | 1.03 |
Diffraction radiation probe | x-ray |
Diffraction radiation wavelength | 0.71073 Å |
Diffraction radiation type | MoKα |
Diffraction radiation X-ray symbol | K-L~3~ |