Information card for entry 7035593
Formula | C33 H34 F6 N P3 Ru |
Calculated formula | C33 H34 F6 N P3 Ru |
SMILES | [Ru]12345([P](CC[P]1(c1ccccc1)c1ccccc1)(c1ccccc1)c1ccccc1)(=C(N)C)[cH]1[cH]2[cH]3[cH]4[cH]51.[P](F)(F)(F)(F)(F)[F-] |
Title of publication | Syntheses, structural characterisation and electronic structures of some simple acyclic amino carbene complexes. |
Authors of publication | Eaves, Samantha G.; Yufit, Dmitry S.; Skelton, Brian W.; Howard, Judith A. K.; Low, Paul J. |
Journal of publication | Dalton transactions (Cambridge, England : 2003) |
Year of publication | 2015 |
Journal volume | 44 |
Journal issue | 32 |
Pages of publication | 14341 - 14348 |
a | 21.9074 ± 0.0003 Å |
b | 15.4771 ± 0.0002 Å |
c | 19.0631 ± 0.0002 Å |
α | 90° |
β | 99.922 ± 0.001° |
γ | 90° |
Cell volume | 6366.92 ± 0.14 Å3 |
Cell temperature | 100 ± 2 K |
Ambient diffraction temperature | 100 ± 2 K |
Number of distinct elements | 6 |
Space group number | 14 |
Hermann-Mauguin space group symbol | P 1 21/c 1 |
Hall space group symbol | -P 2ybc |
Residual factor for all reflections | 0.0493 |
Residual factor for significantly intense reflections | 0.0389 |
Weighted residual factors for significantly intense reflections | 0.0921 |
Weighted residual factors for all reflections included in the refinement | 0.0971 |
Goodness-of-fit parameter for all reflections included in the refinement | 1.046 |
Diffraction radiation probe | x-ray |
Diffraction radiation wavelength | 0.71073 Å |
Diffraction radiation type | MoKα |