Information card for entry 7035637
Formula | C44 H50 Al N2 Na |
Calculated formula | C44 H50 Al N2 Na |
SMILES | [Al]12(N(C(=C(N1c1c(cccc1C(C)C)C(C)C)C)C)c1c(cccc1C(C)C)C(C)C)[C](#Cc1ccccc1)[Na][C]2#Cc1ccccc1 |
Title of publication | Reactions of α-diimine-aluminum complexes with sodium alkynides: versatile structures of aluminum σ-alkynide complexes. |
Authors of publication | Zhao, Yanxia; Liu, Yanyan; Wu, Biao; Yang, Xiao-Juan |
Journal of publication | Dalton transactions (Cambridge, England : 2003) |
Year of publication | 2015 |
Journal volume | 44 |
Journal issue | 30 |
Pages of publication | 13671 - 13680 |
a | 8.841 ± 0.004 Å |
b | 12.395 ± 0.006 Å |
c | 18.281 ± 0.009 Å |
α | 84.253 ± 0.006° |
β | 87.165 ± 0.006° |
γ | 76.832 ± 0.007° |
Cell volume | 1940.1 ± 1.6 Å3 |
Cell temperature | 153 ± 2 K |
Ambient diffraction temperature | 153 ± 2 K |
Number of distinct elements | 5 |
Space group number | 2 |
Hermann-Mauguin space group symbol | P -1 |
Hall space group symbol | -P 1 |
Residual factor for all reflections | 0.1201 |
Residual factor for significantly intense reflections | 0.0612 |
Weighted residual factors for significantly intense reflections | 0.1332 |
Weighted residual factors for all reflections included in the refinement | 0.1597 |
Goodness-of-fit parameter for all reflections included in the refinement | 1.004 |
Diffraction radiation wavelength | 0.71073 Å |
Diffraction radiation type | MoKα |