Information card for entry 7035644
Formula | C27 H20 Br Cl6 Hg N2 P S |
Calculated formula | C27 H20 Br Cl6 Hg N2 P S |
Title of publication | Formation of ortho-cyano-aminothiophenolate ligands with versatile binding modes via facile carbon-sulfur bond cleavage of 2-aminobenzothiazoles at mercury(ii) centres. |
Authors of publication | Al-Jibori, Subhi A; Irzoqi, Ahmed A.; Al-Saraj, Emad G H; Al-Janabi, Ahmed S M; Basak-Modi, Sucharita; Ghosh, Shishir; Merzweiler, Kurt; Wagner, Christoph; Schmidt, Harry; Hogarth, Graeme |
Journal of publication | Dalton transactions (Cambridge, England : 2003) |
Year of publication | 2015 |
Journal volume | 44 |
Journal issue | 32 |
Pages of publication | 14217 - 14219 |
a | 9.444 ± 0.003 Å |
b | 12.224 ± 0.003 Å |
c | 13.807 ± 0.004 Å |
α | 86.793 ± 0.004° |
β | 79.034 ± 0.004° |
γ | 87.326 ± 0.005° |
Cell volume | 1561.3 ± 0.8 Å3 |
Cell temperature | 150 ± 2 K |
Ambient diffraction temperature | 150 ± 2 K |
Number of distinct elements | 8 |
Space group number | 2 |
Hermann-Mauguin space group symbol | P -1 |
Hall space group symbol | -P 1 |
Residual factor for all reflections | 0.0581 |
Residual factor for significantly intense reflections | 0.0449 |
Weighted residual factors for significantly intense reflections | 0.0945 |
Weighted residual factors for all reflections included in the refinement | 0.0966 |
Goodness-of-fit parameter for all reflections included in the refinement | 0.942 |
Diffraction radiation wavelength | 0.71073 Å |
Diffraction radiation type | MoKα |