Information card for entry 7035646
Formula | C72 H104 Co9 N24 O96 P2 W18 |
Calculated formula | C72 H48 Co9 N24 O96 P2 W18 |
Title of publication | An organic-inorganic hybrid photocatalyst based on sandwich-type tetra-Co-substituted phosphotungstates with high visible light photocatalytic activity. |
Authors of publication | Song, Bai-Qiao; Wang, Xin-Long; Sun, Chun-Yi; Zhang, Yu-Teng; Wu, Xue-Song; Yang, Liu; Shao, Kui-Zhan; Zhao, Liang; Su, Zhong-Min |
Journal of publication | Dalton transactions (Cambridge, England : 2003) |
Year of publication | 2015 |
Journal volume | 44 |
Journal issue | 31 |
Pages of publication | 13818 - 13822 |
a | 29.325 ± 0.005 Å |
b | 13.413 ± 0.005 Å |
c | 36.016 ± 0.005 Å |
α | 90° |
β | 90° |
γ | 90° |
Cell volume | 14166 ± 6 Å3 |
Cell temperature | 293 ± 2 K |
Ambient diffraction temperature | 293 ± 2 K |
Number of distinct elements | 7 |
Space group number | 61 |
Hermann-Mauguin space group symbol | P b c a |
Hall space group symbol | -P 2ac 2ab |
Residual factor for all reflections | 0.0643 |
Residual factor for significantly intense reflections | 0.0391 |
Weighted residual factors for significantly intense reflections | 0.0984 |
Weighted residual factors for all reflections included in the refinement | 0.1185 |
Goodness-of-fit parameter for all reflections included in the refinement | 1.044 |
Diffraction radiation wavelength | 0.71069 Å |
Diffraction radiation type | MoKα |