Information card for entry 7035650
Formula | C46 H44 Cu2 Mo N12 O10 Tb |
Calculated formula | C46 H40 Cu2 Mo N12 O10 Tb |
Title of publication | Magneto-structural variety of new 3d-4f-4(5)d heterotrimetallic complexes. |
Authors of publication | Visinescu, Diana; Alexandru, Maria-Gabriela; Madalan, Augustin M.; Pichon, Céline; Duhayon, Carine; Sutter, Jean-Pascal; Andruh, Marius |
Journal of publication | Dalton transactions (Cambridge, England : 2003) |
Year of publication | 2015 |
Journal volume | 44 |
Journal issue | 38 |
Pages of publication | 16713 - 16727 |
a | 11.4193 ± 0.0007 Å |
b | 12.3706 ± 0.0009 Å |
c | 20.6069 ± 0.0015 Å |
α | 95.112 ± 0.006° |
β | 101.921 ± 0.005° |
γ | 116.803 ± 0.005° |
Cell volume | 2486.2 ± 0.3 Å3 |
Cell temperature | 293 ± 2 K |
Ambient diffraction temperature | 293 ± 2 K |
Number of distinct elements | 7 |
Space group number | 2 |
Hermann-Mauguin space group symbol | P -1 |
Hall space group symbol | -P 1 |
Residual factor for all reflections | 0.1067 |
Residual factor for significantly intense reflections | 0.0548 |
Weighted residual factors for significantly intense reflections | 0.1012 |
Weighted residual factors for all reflections included in the refinement | 0.1174 |
Goodness-of-fit parameter for all reflections included in the refinement | 0.926 |
Diffraction radiation wavelength | 0.71073 Å |
Diffraction radiation type | MoKα |