Information card for entry 7035655
Formula | C29 H35 Cu Gd N11 O10 W |
Calculated formula | C29 H23 Cu Gd N11 O10 W |
Title of publication | Magneto-structural variety of new 3d-4f-4(5)d heterotrimetallic complexes. |
Authors of publication | Visinescu, Diana; Alexandru, Maria-Gabriela; Madalan, Augustin M.; Pichon, Céline; Duhayon, Carine; Sutter, Jean-Pascal; Andruh, Marius |
Journal of publication | Dalton transactions (Cambridge, England : 2003) |
Year of publication | 2015 |
Journal volume | 44 |
Journal issue | 38 |
Pages of publication | 16713 - 16727 |
a | 9.1369 ± 0.0003 Å |
b | 20.3271 ± 0.0009 Å |
c | 10.3756 ± 0.0003 Å |
α | 90° |
β | 96.597 ± 0.003° |
γ | 90° |
Cell volume | 1914.27 ± 0.12 Å3 |
Cell temperature | 293 ± 2 K |
Ambient diffraction temperature | 293 ± 2 K |
Number of distinct elements | 7 |
Space group number | 4 |
Hermann-Mauguin space group symbol | P 1 21 1 |
Hall space group symbol | P 2yb |
Residual factor for all reflections | 0.0375 |
Residual factor for significantly intense reflections | 0.0318 |
Weighted residual factors for significantly intense reflections | 0.0712 |
Weighted residual factors for all reflections included in the refinement | 0.0727 |
Goodness-of-fit parameter for all reflections included in the refinement | 1 |
Diffraction radiation wavelength | 0.71073 Å |
Diffraction radiation type | MoKα |